Skip to content

chore: upgrade tonic and prost (#6067) #1348

chore: upgrade tonic and prost (#6067)

chore: upgrade tonic and prost (#6067) #1348

Triggered via push January 12, 2024 15:08
Status Success
Total duration 5h 52m 17s
Artifacts
This run and associated checks have been archived and are scheduled for deletion. Learn more about checks retention

coverage.yml

on: push
test and generate coverage
5h 51m
test and generate coverage
Fit to window
Zoom out
Zoom in

Annotations

62 errors
feature:33:3.Scenario: Simple reorg with burned output: tests/features/Reorgs.feature:33:3: feature:33:3#L1
Step panicked. Captured output: wallet WB failed to get balance of at least amount 55000000000, current amount is 0
feature:33:3.Scenario: Simple reorg with burned output: tests/features/Reorgs.feature:33:3: feature:33:3#L1
Step panicked. Captured output: wallet WB failed to get balance of at least amount 55000000000, current amount is 0
feature:33:3.Scenario: Simple reorg with burned output: tests/features/Reorgs.feature:33:3: feature:33:3#L1
Step panicked. Captured output: wallet WB failed to get balance of at least amount 55000000000, current amount is 0
feature:34:3.Scenario: Sync burned output: tests/features/Sync.feature:34:3: feature:34:3#L1
Step panicked. Captured output: wallet WALLET_A failed to get balance of at least amount 55000000000, current amount is 0
feature:34:3.Scenario: Sync burned output: tests/features/Sync.feature:34:3: feature:34:3#L1
Step panicked. Captured output: wallet WALLET_A failed to get balance of at least amount 55000000000, current amount is 0
feature:34:3.Scenario: Sync burned output: tests/features/Sync.feature:34:3: feature:34:3#L1
Step panicked. Captured output: wallet WALLET_A failed to get balance of at least amount 55000000000, current amount is 0
feature:18:3.Scenario: As a wallet I want to submit a transaction: tests/features/WalletQuery.feature:18:3: feature:18:3#L1
Step panicked. Captured output: Wallet WALLET_A failed to have at least 10T
feature:18:3.Scenario: As a wallet I want to submit a transaction: tests/features/WalletQuery.feature:18:3: feature:18:3#L1
Step panicked. Captured output: Wallet WALLET_A failed to have at least 10T
feature:18:3.Scenario: As a wallet I want to submit a transaction: tests/features/WalletQuery.feature:18:3: feature:18:3#L1
Step panicked. Captured output: Wallet WALLET_A failed to have at least 10T
feature:8:3.Scenario: Wallet sending and receiving one-sided transactions: tests/features/WalletTransactions.feature:8:3: feature:8:3#L1
Step panicked. Captured output: wallet WALLET_A failed to get balance of at least amount 55000000000, current amount is 0
feature:411:3.Scenario: Create burn transaction: tests/features/WalletTransactions.feature:411:3: feature:411:3#L1
Step panicked. Captured output: wallet WALLET_A failed to get balance of at least amount 221552530060, current amount is 0
feature:8:3.Scenario: Wallet sending and receiving one-sided transactions: tests/features/WalletTransactions.feature:8:3: feature:8:3#L1
Step panicked. Captured output: wallet WALLET_A failed to get balance of at least amount 55000000000, current amount is 0
feature:411:3.Scenario: Create burn transaction: tests/features/WalletTransactions.feature:411:3: feature:411:3#L1
Step panicked. Captured output: wallet WALLET_A failed to get balance of at least amount 221552530060, current amount is 0
feature:8:3.Scenario: Wallet sending and receiving one-sided transactions: tests/features/WalletTransactions.feature:8:3: feature:8:3#L1
Step panicked. Captured output: wallet WALLET_A failed to get balance of at least amount 55000000000, current amount is 0
feature:411:3.Scenario: Create burn transaction: tests/features/WalletTransactions.feature:411:3: feature:411:3#L1
Step panicked. Captured output: wallet WALLET_A failed to get balance of at least amount 221552530060, current amount is 0
feature:73:5.Scenario: As a client I want to receive contact liveness events: tests/features/WalletFFI.feature:73:5: feature:73:5#L1
Step panicked. Captured output: wallet WALLET1 failed to get balance of at least amount 100000000, current amount is 0
feature:73:5.Scenario: As a client I want to receive contact liveness events: tests/features/WalletFFI.feature:73:5: feature:73:5#L1
Step panicked. Captured output: wallet WALLET1 failed to get balance of at least amount 100000000, current amount is 0
feature:73:5.Scenario: As a client I want to receive contact liveness events: tests/features/WalletFFI.feature:73:5: feature:73:5#L1
Step panicked. Captured output: wallet WALLET1 failed to get balance of at least amount 100000000, current amount is 0
tari_core::core_integration_tests.tests::horizon_sync::test_horizon_sync_to_archival_node_happy_path: tari_core::core_integration_tests#L1
thread 'tests::horizon_sync::test_horizon_sync_to_archival_node_happy_path' panicked at 'called `Result::unwrap()` on an `Err` value: You are spending more than you're providing: provided 498.829654 T, required 20000.005750 T.', /runner/_work/tari/tari/base_layer/core/src/transactions/test_helpers.rs:663:50 note: run with `RUST_BACKTRACE=1` environment variable to display a backtrace
feature:26:3.Scenario: Simple propagation: tests/features/Propagation.feature:26:3: feature:26:3#L1
Step panicked. Captured output: base nodes not successfully synchronized at height 5, {"seed_node_0": 9, "seed_node_1": 9, "Node_0": 9, "Node_1": 9, "Node_2": 9, "Node_3": 9, "MINER": 5}
feature:26:3.Scenario: Simple propagation: tests/features/Propagation.feature:26:3: feature:26:3#L1
Step panicked. Captured output: Service on port 18133 never started
feature:26:3.Scenario: Simple block sync: tests/features/Sync.feature:26:3: feature:26:3#L1
Step panicked. Captured output: Service on port 18946 never started
feature:26:3.Scenario: Simple propagation: tests/features/Propagation.feature:26:3: feature:26:3#L1
Step panicked. Captured output: called `Result::unwrap()` on an `Err` value: transport error Caused by: 0: error trying to connect: tcp connect error: Connection refused (os error 111) 1: tcp connect error: Connection refused (os error 111) 2: Connection refused (os error 111)
minotari_wallet::wallet_integration_tests.transaction_service_tests::service::test_update_faux_tx_on_oms_validation: minotari_wallet::wallet_integration_tests#L1
thread 'transaction_service_tests::service::test_update_faux_tx_on_oms_validation' panicked at 'Should have found the updated statuses', base_layer/wallet/tests/transaction_service_tests/service.rs:5302:5 note: run with `RUST_BACKTRACE=1` environment variable to display a backtrace
feature:33:3.Scenario: Simple reorg with burned output: tests/features/Reorgs.feature:33:3: feature:33:3#L1
Step panicked. Captured output: wallet WB failed to get balance of at least amount 55000000000, current amount is 0
feature:33:3.Scenario: Simple reorg with burned output: tests/features/Reorgs.feature:33:3: feature:33:3#L1
Step panicked. Captured output: wallet WB failed to get balance of at least amount 55000000000, current amount is 0
feature:33:3.Scenario: Simple reorg with burned output: tests/features/Reorgs.feature:33:3: feature:33:3#L1
Step panicked. Captured output: wallet WB failed to get balance of at least amount 55000000000, current amount is 0
feature:34:3.Scenario: Sync burned output: tests/features/Sync.feature:34:3: feature:34:3#L1
Step panicked. Captured output: wallet WALLET_A failed to get balance of at least amount 55000000000, current amount is 0
feature:34:3.Scenario: Sync burned output: tests/features/Sync.feature:34:3: feature:34:3#L1
Step panicked. Captured output: wallet WALLET_A failed to get balance of at least amount 55000000000, current amount is 0
feature:34:3.Scenario: Sync burned output: tests/features/Sync.feature:34:3: feature:34:3#L1
Step panicked. Captured output: wallet WALLET_A failed to get balance of at least amount 55000000000, current amount is 0
feature:18:3.Scenario: As a wallet I want to submit a transaction: tests/features/WalletQuery.feature:18:3: feature:18:3#L1
Step panicked. Captured output: Wallet WALLET_A failed to have at least 10T
feature:18:3.Scenario: As a wallet I want to submit a transaction: tests/features/WalletQuery.feature:18:3: feature:18:3#L1
Step panicked. Captured output: Wallet WALLET_A failed to have at least 10T
feature:18:3.Scenario: As a wallet I want to submit a transaction: tests/features/WalletQuery.feature:18:3: feature:18:3#L1
Step panicked. Captured output: Wallet WALLET_A failed to have at least 10T
feature:8:3.Scenario: Wallet sending and receiving one-sided transactions: tests/features/WalletTransactions.feature:8:3: feature:8:3#L1
Step panicked. Captured output: wallet WALLET_A failed to get balance of at least amount 55000000000, current amount is 0
feature:411:3.Scenario: Create burn transaction: tests/features/WalletTransactions.feature:411:3: feature:411:3#L1
Step panicked. Captured output: wallet WALLET_A failed to get balance of at least amount 221552530060, current amount is 0
feature:8:3.Scenario: Wallet sending and receiving one-sided transactions: tests/features/WalletTransactions.feature:8:3: feature:8:3#L1
Step panicked. Captured output: wallet WALLET_A failed to get balance of at least amount 55000000000, current amount is 0
feature:411:3.Scenario: Create burn transaction: tests/features/WalletTransactions.feature:411:3: feature:411:3#L1
Step panicked. Captured output: wallet WALLET_A failed to get balance of at least amount 221552530060, current amount is 0
feature:8:3.Scenario: Wallet sending and receiving one-sided transactions: tests/features/WalletTransactions.feature:8:3: feature:8:3#L1
Step panicked. Captured output: wallet WALLET_A failed to get balance of at least amount 55000000000, current amount is 0
feature:411:3.Scenario: Create burn transaction: tests/features/WalletTransactions.feature:411:3: feature:411:3#L1
Step panicked. Captured output: wallet WALLET_A failed to get balance of at least amount 221552530060, current amount is 0
feature:73:5.Scenario: As a client I want to receive contact liveness events: tests/features/WalletFFI.feature:73:5: feature:73:5#L1
Step panicked. Captured output: wallet WALLET1 failed to get balance of at least amount 100000000, current amount is 0
feature:73:5.Scenario: As a client I want to receive contact liveness events: tests/features/WalletFFI.feature:73:5: feature:73:5#L1
Step panicked. Captured output: wallet WALLET1 failed to get balance of at least amount 100000000, current amount is 0
feature:73:5.Scenario: As a client I want to receive contact liveness events: tests/features/WalletFFI.feature:73:5: feature:73:5#L1
Step panicked. Captured output: wallet WALLET1 failed to get balance of at least amount 100000000, current amount is 0
feature:8:3.Scenario: Transactions are propagated through a network: tests/features/Mempool.feature:8:3: feature:8:3#L1
Step panicked. Captured output: called `Result::unwrap()` on an `Err` value: transport error Caused by: 0: error trying to connect: tcp connect error: Connection refused (os error 111) 1: tcp connect error: Connection refused (os error 111) 2: Connection refused (os error 111)
feature:33:3.Scenario: Simple reorg with burned output: tests/features/Reorgs.feature:33:3: feature:33:3#L1
Step panicked. Captured output: wallet WB failed to get balance of at least amount 55000000000, current amount is 0
feature:34:3.Scenario: Sync burned output: tests/features/Sync.feature:34:3: feature:34:3#L1
Step panicked. Captured output: wallet WALLET_A failed to get balance of at least amount 55000000000, current amount is 0
feature:34:3.Scenario: Sync burned output: tests/features/Sync.feature:34:3: feature:34:3#L1
Step panicked. Captured output: wallet WALLET_A failed to get balance of at least amount 55000000000, current amount is 0
feature:34:3.Scenario: Sync burned output: tests/features/Sync.feature:34:3: feature:34:3#L1
Step panicked. Captured output: wallet WALLET_A failed to get balance of at least amount 55000000000, current amount is 0
feature:8:3.Scenario: Wallet sending and receiving one-sided transactions: tests/features/WalletTransactions.feature:8:3: feature:8:3#L1
Step panicked. Captured output: wallet WALLET_A failed to get balance of at least amount 55000000000, current amount is 0
feature:411:3.Scenario: Create burn transaction: tests/features/WalletTransactions.feature:411:3: feature:411:3#L1
Step panicked. Captured output: wallet WALLET_A failed to get balance of at least amount 221552530060, current amount is 0
feature:411:3.Scenario: Create burn transaction: tests/features/WalletTransactions.feature:411:3: feature:411:3#L1
Step panicked. Captured output: wallet WALLET_A failed to get balance of at least amount 221552530060, current amount is 0
feature:8:3.Scenario: Wallet sending and receiving one-sided transactions: tests/features/WalletTransactions.feature:8:3: feature:8:3#L1
Step panicked. Captured output: wallet WALLET_A failed to get balance of at least amount 55000000000, current amount is 0
feature:8:3.Scenario: Wallet sending and receiving one-sided transactions: tests/features/WalletTransactions.feature:8:3: feature:8:3#L1
Step panicked. Captured output: wallet WALLET_A failed to get balance of at least amount 55000000000, current amount is 0
feature:411:3.Scenario: Create burn transaction: tests/features/WalletTransactions.feature:411:3: feature:411:3#L1
Step panicked. Captured output: wallet WALLET_A failed to get balance of at least amount 221552530060, current amount is 0
feature:73:5.Scenario: As a client I want to receive contact liveness events: tests/features/WalletFFI.feature:73:5: feature:73:5#L1
Step panicked. Captured output: wallet WALLET1 failed to get balance of at least amount 100000000, current amount is 0
feature:73:5.Scenario: As a client I want to receive contact liveness events: tests/features/WalletFFI.feature:73:5: feature:73:5#L1
Step panicked. Captured output: wallet WALLET1 failed to get balance of at least amount 100000000, current amount is 0
feature:73:5.Scenario: As a client I want to receive contact liveness events: tests/features/WalletFFI.feature:73:5: feature:73:5#L1
Step panicked. Captured output: wallet WALLET1 failed to get balance of at least amount 100000000, current amount is 0