Skip to content

chore(ci): add metrics targeted build, remove miner artifacts, misc c… #1395

chore(ci): add metrics targeted build, remove miner artifacts, misc c…

chore(ci): add metrics targeted build, remove miner artifacts, misc c… #1395

Triggered via push February 9, 2024 10:26
Status Failure
Total duration 6h 16m 29s
Artifacts

coverage.yml

on: push
test and generate coverage
6h 0m
test and generate coverage
Fit to window
Zoom out
Zoom in

Annotations

12 errors
tari_core.transactions::transaction_components::test::kernel_hash: tari_core#L1
thread 'transactions::transaction_components::test::kernel_hash' panicked at 'assertion failed: `(left == right)` left: `"db7290fc12ff8cd26a488809bcee2f3f47dc263fc236f3061faf87829abba648"`,
tari_core.transactions::transaction_components::test::kernel_metadata: tari_core#L1
thread 'transactions::transaction_components::test::kernel_metadata' panicked at 'assertion failed: `(left == right)` left: `"7c6be880b7d103d80bdf57990a88d11f769a0ac9bc0ed87658d39b87239a1d9c"`,
minotari_wallet::wallet_integration_tests.transaction_service_tests::service::manage_multiple_transactions: minotari_wallet::wallet_integration_tests#L1
thread 'transaction_service_tests::service::manage_multiple_transactions' panicked at 'assertion failed: `(left == right)` left: `1`,
tari_core.transactions::transaction_components::test::kernel_hash: tari_core#L1
thread 'transactions::transaction_components::test::kernel_hash' panicked at 'assertion failed: `(left == right)` left: `"db7290fc12ff8cd26a488809bcee2f3f47dc263fc236f3061faf87829abba648"`,
tari_core.transactions::transaction_components::test::kernel_metadata: tari_core#L1
thread 'transactions::transaction_components::test::kernel_metadata' panicked at 'assertion failed: `(left == right)` left: `"7c6be880b7d103d80bdf57990a88d11f769a0ac9bc0ed87658d39b87239a1d9c"`,
minotari_wallet::wallet_integration_tests.transaction_service_tests::service::manage_multiple_transactions: minotari_wallet::wallet_integration_tests#L1
thread 'transaction_service_tests::service::manage_multiple_transactions' panicked at 'assertion failed: `(left == right)` left: `1`,
minotari_wallet::wallet_integration_tests.transaction_service_tests::service::manage_multiple_transactions: minotari_wallet::wallet_integration_tests#L1
thread 'transaction_service_tests::service::manage_multiple_transactions' panicked at 'assertion failed: `(left == right)` left: `1`,
test and generate coverage
The job running on runner hetzner-generic-runner-jcf5z-jdjsq has exceeded the maximum execution time of 360 minutes.
test and generate coverage
The operation was canceled.
minotari_wallet::wallet_integration_tests.transaction_service_tests::service::manage_multiple_transactions: minotari_wallet::wallet_integration_tests#L1
thread 'transaction_service_tests::service::manage_multiple_transactions' panicked at 'assertion failed: `(left == right)` left: `1`,
minotari_wallet::wallet_integration_tests.transaction_service_tests::service::manage_multiple_transactions: minotari_wallet::wallet_integration_tests#L1
thread 'transaction_service_tests::service::manage_multiple_transactions' panicked at 'called `Result::unwrap()` on an `Err` value: OutputManagerError(OutputManagerStorageError(DieselError(DatabaseError(Unknown, "database is locked"))))', base_layer/wallet/tests/transaction_service_tests/service.rs:1826:10 note: run with `RUST_BACKTRACE=1` environment variable to display a backtrace
feature:8:3.Scenario: Wallet sending and receiving one-sided transactions: tests/features/WalletTransactions.feature:8:3: feature:8:3#L1
Step panicked. Captured output: One sided transaction from WALLET_A to WALLET_B with amount 1000000 at fee 100 failed to be broadcasted