chore: new release v1.11.5-pre.0 (#6804) #1834
GitHub Actions / JUnit Test Report
failed
Feb 24, 2025 in 0s
1451 tests run, 1449 passed, 0 skipped, 2 failed.
Annotations
Check failure on line 359 in applications/minotari_merge_mining_proxy/src/block_template_data.rs
github-actions / JUnit Test Report
applications/minotari_merge_mining_proxy/src/block_template_data.rs.block_template_data::test::test_block_template_repository
thread 'block_template_data::test::test_block_template_repository' panicked at applications/minotari_merge_mining_proxy/src/block_template_data.rs:359:9
Raw output
thread 'block_template_data::test::test_block_template_repository' panicked at applications/minotari_merge_mining_proxy/src/block_template_data.rs:359:9:
assertion failed: btr.get_final_template(hash1.clone()).await.is_some()
note: run with `RUST_BACKTRACE=1` environment variable to display a backtrace
Check failure on line 1 in minotari_merge_mining_proxy::bin/minotari_merge_mining_proxy
github-actions / JUnit Test Report
minotari_merge_mining_proxy::bin/minotari_merge_mining_proxy.block_template_data::test::test_block_template_repository
thread 'block_template_data::test::test_block_template_repository' panicked at applications/minotari_merge_mining_proxy/src/block_template_data.rs:359:9
Raw output
thread 'block_template_data::test::test_block_template_repository' panicked at applications/minotari_merge_mining_proxy/src/block_template_data.rs:359:9:
assertion failed: btr.get_final_template(hash1.clone()).await.is_some()
note: run with `RUST_BACKTRACE=1` environment variable to display a backtrace
Loading